﻿id,chol,stab.glu,hdl,ratio,glyhb,location,age,gender,height,weight,frame,bp.1s,bp.1d,bp.2s,bp.2d,waist,hip,time.ppn
1000,203,82,56,3.599999905,4.309999943,Buckingham,46,female,62,121,medium,118,59,,,29,38,720
1001,165,97,24,6.900000095,4.440000057,Buckingham,29,female,64,218,large,112,68,,,46,48,360
1002,228,92,37,6.199999809,4.639999866,Buckingham,58,female,61,256,large,190,92,185,92,49,57,180
1003,78,93,12,6.5,4.630000114,Buckingham,67,male,67,119,large,110,50,,,33,38,480
1005,249,90,28,8.899999619,7.71999979,Buckingham,64,male,68,183,medium,138,80,,,44,41,300
1008,248,94,69,3.599999905,4.809999943,Buckingham,34,male,71,190,large,132,86,,,36,42,195
1011,195,92,41,4.800000191,4.840000153,Buckingham,30,male,69,191,medium,161,112,161,112,46,49,720
1015,227,75,44,5.199999809,3.940000057,Buckingham,37,male,59,170,medium,,,,,34,39,1020
1016,177,87,49,3.599999905,4.840000153,Buckingham,45,male,69,166,large,160,80,128,86,34,40,300
1022,263,89,40,6.599999905,5.78000021,Buckingham,55,female,63,202,small,108,72,,,45,50,240
1024,242,82,54,4.5,4.769999981,Louisa,60,female,65,156,medium,130,90,130,90,39,45,300
1029,215,128,34,6.300000191,4.96999979,Louisa,38,female,58,195,medium,102,68,,,42,50,90
1030,238,75,36,6.599999905,4.46999979,Louisa,27,female,60,170,medium,130,80,,,35,41,720
1031,183,79,46,4,4.590000153,Louisa,40,female,59,165,medium,,,,,37,43,60
1035,191,76,30,6.400000095,4.670000076,Louisa,36,male,69,183,medium,100,66,,,36,40,225
1036,213,83,47,4.5,3.410000086,Louisa,33,female,65,157,medium,130,90,120,96,37,41,240
1037,255,78,38,6.699999809,4.329999924,Louisa,50,female,65,183,medium,130,100,,,37,43,180
1041,230,112,64,3.599999905,4.53000021,Louisa,20,male,67,159,medium,100,90,,,31,39,1440
1045,194,81,36,5.400000095,5.28000021,Louisa,36,male,64,126,medium,110,76,,,30,34,120
1250,196,206,41,4.800000191,11.23999977,Buckingham,62,female,65,196,large,178,90,,,46,51,540
1252,186,97,50,3.700000048,6.489999771,Buckingham,70,male,67,178,large,148,88,148,84,42,41,1020
1253,234,65,76,3.099999905,4.670000076,Buckingham,47,male,67,230,large,137,100,149,110,45,46,480
1254,203,299,43,4.699999809,12.73999977,Buckingham,38,female,69,288,large,136,83,,,48,55,240
1256,281,92,41,6.900000095,5.559999943,Buckingham,66,female,62,185,large,158,88,160,88,48,44,285
1271,228,66,45,5.099999905,4.610000134,Buckingham,24,female,61,113,medium,100,70,110,70,33,38,210
1277,179,80,92,1.899999976,4.179999828,Buckingham,41,female,72,118,small,144,112,,,28,36,780
1280,232,87,30,7.699999809,5.099999905,Buckingham,37,male,68,252,large,140,95,,,43,47,420
1281,,74,,,4.28000021,Buckingham,48,male,68,100,small,120,85,,,27,33,510
1282,254,84,52,4.900000095,4.519999981,Buckingham,43,female,62,145,medium,125,70,,,31,38,720
1285,215,72,42,5.099999905,4.369999886,Louisa,40,male,70,189,medium,180,122,170,112,37,39,450
1301,177,101,36,4.900000095,5.110000134,Buckingham,42,female,65,174,medium,146,94,139,89,37,40,540
1303,182,85,43,4.199999809,4.46999979,Buckingham,52,male,68,139,large,130,90,,,29,35,780
1304,265,330,34,7.800000191,15.52000046,Buckingham,61,male,74,191,medium,170,88,168,80,39,41,225
1305,182,85,37,4.900000095,5.659999847,Buckingham,61,female,69,174,medium,176,86,180,90,49,43,330
1309,199,87,63,3.200000048,3.670000076,Buckingham,25,male,66,118,medium,120,78,,,32,34,720
1312,183,81,60,3.099999905,4.03000021,Buckingham,47,female,66,186,medium,140,97,,,39,44,780
1313,194,86,67,2.900000095,2.680000067,Buckingham,35,male,66,159,medium,115,64,,,31,35,720
1314,190,107,32,5.900000095,3.559999943,Buckingham,46,male,72,205,medium,,,,,46,49,240
1315,173,80,57,3,6.210000038,Buckingham,57,male,71,145,medium,124,64,,,31,36,30
1316,182,206,43,4.199999809,7.909999847,Buckingham,70,male,69,214,large,158,90,160,96,45,48,840
1317,136,81,51,2.700000048,4.579999924,Buckingham,22,female,66,160,large,105,85,,,35,40,720
1321,218,68,46,4.699999809,3.890000105,Buckingham,52,female,62,170,medium,142,79,,,40,43,720
1323,225,83,42,5.400000095,4.380000114,Buckingham,36,male,67,192,large,149,89,136,88,40,42,30
1326,262,84,38,6.900000095,,Buckingham,43,male,75,253,large,124,80,,,43,49,300
1500,213,76,40,5.300000191,5.960000038,Buckingham,72,female,59,137,large,130,60,,,40,40,90
1501,243,52,59,4.099999905,4.409999847,Buckingham,37,female,64,233,medium,110,82,,,49,57,90
1502,148,193,14,10.60000038,6.139999866,Buckingham,54,female,67,165,medium,140,65,,,42,42,150
2004,128,223,24,5.300000191,10.89999962,Buckingham,60,male,67,196,medium,110,68,,,42,43,450
2750,169,85,51,3.299999952,6.139999866,Buckingham,40,female,65,180,medium,106,82,,,40,44,780
2753,157,74,47,3.299999952,5.570000172,Buckingham,55,female,66,219,medium,150,82,142,78,43,52,360
2754,196,82,58,3.400000095,4.25,Buckingham,76,male,65,154,,158,78,140,84,37,41,120
2756,237,87,41,5.800000191,5.349999905,Buckingham,43,female,64,181,medium,104,90,,,36,46,240
2757,212,97,45,4.699999809,6.329999924,Buckingham,65,female,61,187,large,158,94,149,96,43,47,360
2758,233,92,39,6,4.559999943,Buckingham,45,female,64,167,large,124,86,,,39,44,270
2762,289,111,50,5.800000191,9.390000343,Buckingham,70,female,60,220,medium,126,80,,,51,54,780
2763,193,106,63,3.099999905,6.349999905,Buckingham,20,female,68,274,small,165,110,153,100,49,58,60
2765,204,128,61,3.299999952,5.199999809,Buckingham,62,male,68,180,large,141,81,,,38,41,540
2770,165,94,69,2.400000095,4.980000019,Buckingham,92,female,62,217,large,160,82,,,51,51,180
2773,237,233,58,4.099999905,13.69999981,Buckingham,49,female,62,189,large,130,90,,,43,47,195
2774,218,88,39,5.599999905,,Buckingham,44,female,66,191,large,138,79,,,40,45,720
2775,296,262,60,4.900000095,10.93000031,Buckingham,74,female,63,183,large,159,99,160,103,42,48,300
2777,178,78,59,3,5.230000019,Buckingham,36,male,70,161,medium,130,79,,,34,40,720
2778,443,185,23,19.29999924,14.31000042,Buckingham,51,female,70,235,medium,158,98,148,88,43,48,420
2780,145,85,29,5,3.99000001,Buckingham,38,female,,125,,,,,,31,35,120
2784,234,80,63,3.700000048,,Buckingham,31,male,70,165,medium,121,71,,,35,39,720
2785,146,77,60,2.400000095,4.269999981,Buckingham,28,female,64,126,small,120,90,,,28,32,180
2787,223,75,85,2.599999905,4.25,Buckingham,22,female,62,137,medium,120,70,,,28,35,960
2791,213,203,75,2.799999952,11.40999985,Buckingham,71,female,63,165,medium,150,80,145,80,34,42,960
2793,173,131,69,2.5,4.440000057,Buckingham,76,female,61,102,medium,160,60,160,60,31,33,1020
2794,232,184,114,2,8.399999619,Buckingham,91,female,61,127,,170,82,,,35,38,120
2795,171,92,54,3.200000048,4.590000153,Buckingham,40,male,71,214,medium,138,94,140,80,41,39,240
3250,164,86,40,4.099999905,5.230000019,Buckingham,23,female,69,245,large,126,75,,,44,47,420
3750,170,69,64,2.700000048,4.389999866,Buckingham,20,female,64,161,medium,108,70,,,37,40,120
3751,180,84,69,2.599999905,5.199999809,Buckingham,40,female,68,264,medium,142,98,130,92,43,54,240
3752,204,57,74,2.799999952,6.110000134,Buckingham,52,male,75,142,small,140,90,,,31,35,300
4000,209,113,65,3.200000048,7.440000057,Buckingham,76,female,60,143,large,156,78,144,76,35,40,1200
4500,242,108,53,4.599999905,5.46999979,Buckingham,46,female,62,183,medium,130,86,,,37,45,180
4501,134,105,42,3.200000048,4.289999962,Buckingham,48,male,70,173,large,178,120,182,110,36,40,240
4506,217,81,60,3.599999905,3.930000067,Buckingham,22,female,71,223,medium,120,75,,,46,50,210
4515,251,94,36,7,6.960000038,Buckingham,58,female,63,154,large,174,75,,,38,41,180
4517,217,88,40,5.400000095,4.840000153,Buckingham,34,male,73,219,medium,145,100,,,41,42,270
4750,300,103,44,6.800000191,5.179999828,Louisa,61,female,67,169,small,138,78,,,40,44,10
4751,218,87,38,5.699999809,5.519999981,Louisa,40,male,73,200,small,120,76,,,38,41,210
4753,189,96,47,4,4.380000114,Louisa,28,female,64,200,medium,136,52,,,38,45,60
4758,185,84,52,3.599999905,5.28000021,Louisa,53,female,61,145,medium,147,72,,,37,40,420
4759,206,85,46,4.5,4.820000172,Louisa,67,male,67,178,large,119,68,,,37,41,780
4760,218,182,54,4,10.55000019,Louisa,51,female,,215,large,139,69,,,42,53,720
4761,189,75,72,2.599999905,4.860000134,Louisa,49,female,62,205,medium,120,80,,,40,49,840
4763,229,95,74,3.099999905,4.860000134,Louisa,65,female,62,151,medium,125,64,,,37,42,660
4767,228,76,53,4.300000191,4.110000134,Louisa,54,male,66,170,large,121,62,,,36,41,420
4770,159,88,43,3.700000048,5.019999981,Louisa,38,male,68,169,large,138,79,,,34,40,690
4771,249,197,44,5.699999809,9.170000076,Louisa,64,female,63,159,medium,151,85,148,79,33,41,1140
4772,170,106,42,4,5.110000134,Louisa,41,female,61,110,small,103,64,,,29,30,120
4776,174,125,44,4,5.070000172,Louisa,67,male,68,198,large,119,72,,,36,43,60
4780,204,62,70,2.900000095,4.840000153,Louisa,27,female,67,185,medium,110,90,,,35,44,10
4783,203,84,75,2.700000048,4.099999905,Louisa,21,female,63,142,medium,125,85,117,68,28,39,900
4786,241,86,63,3.799999952,4.789999962,Louisa,41,female,59,139,medium,112,72,,,29,39,1560
4787,245,120,39,6.300000191,7.789999962,Louisa,47,female,63,156,medium,142,102,156,106,35,39,120
4789,143,91,37,3.900000095,5.150000095,Louisa,61,female,65,220,large,160,92,150,98,40,50,20
4790,224,341,33,6.800000191,10.14999962,Louisa,65,male,67,197,medium,160,80,158,80,42,43,390
4792,168,69,45,3.700000048,4.170000076,Louisa,28,female,63,200,large,111,65,,,42,46,780
4793,184,79,39,4.699999809,4.050000191,Louisa,41,male,69,154,large,136,96,130,94,34,39,600
4794,199,130,48,4.099999905,5.440000057,Louisa,37,female,61,203,large,136,84,,,42,51,10
4795,158,91,48,3.299999952,4.309999943,Louisa,50,male,71,180,medium,136,90,126,84,36,40,45
4796,209,176,55,3.799999952,9.770000458,Louisa,57,female,61,150,small,115,68,,,36,39,780
4801,214,111,59,3.599999905,3.890000105,Louisa,28,male,68,204,medium,130,90,,,40,41,60
4802,293,85,94,3.099999905,5.170000076,Louisa,31,female,67,200,medium,110,90,,,41,42,240
4803,227,105,44,5.199999809,5.710000038,Louisa,83,female,59,125,medium,150,90,156,88,35,40,300
4805,292,235,55,5.300000191,7.869999886,Buckingham,79,male,70,165,,170,90,170,100,39,41,240
4808,218,80,71,3.099999905,,Buckingham,68,male,70,170,large,130,73,,,37,42,720
4813,244,101,36,6.800000191,4.659999847,Buckingham,32,male,70,212,,132,90,,,39,44,
4818,283,83,74,3.799999952,4.21999979,Louisa,26,male,72,227,large,158,104,158,108,41,44,330
4821,186,74,76,2.400000095,5.170000076,Louisa,36,male,69,150,small,138,82,,,31,38,60
4822,273,94,49,5.599999905,3.75999999,Louisa,53,female,64,174,medium,160,96,162,96,34,43,30
4823,193,77,49,3.900000095,4.309999943,Louisa,19,female,61,119,small,118,70,,,32,38,300
4825,194,80,34,5.699999809,4.610000134,Buckingham,63,male,73,175,medium,131,88,,,34,39,30
4826,231,105,61,3.799999952,,Buckingham,58,female,63,230,large,141,99,,,39,48,30
4827,217,78,48,4.5,,Buckingham,53,female,63,158,medium,139,79,,,33,40,720
4833,174,173,34,5.099999905,5.349999905,Buckingham,50,male,70,263,large,159,99,150,89,51,64,210
4835,225,84,82,2.700000048,4.360000134,Buckingham,41,male,71,156,small,150,80,,,31,40,120
4840,268,85,51,5.300000191,4.409999847,Louisa,48,male,70,120,small,150,105,150,100,32,35,120
4841,195,108,46,4.199999809,8.449999809,Louisa,59,female,67,172,small,150,102,150,100,38,43,300
4842,179,70,52,3.400000095,3.980000019,Louisa,34,male,72,170,medium,138,82,,,31,39,1170
4843,215,119,44,3.900000095,9.760000229,Louisa,63,female,63,158,medium,160,68,158,74,34,42,240
10000,185,76,58,3.200000048,4.829999924,Buckingham,23,male,76,164,small,124,78,,,32,40,720
10001,132,99,34,3.900000095,4.010000229,Buckingham,21,female,65,169,large,112,62,,,39,43,180
10012,175,91,42,4.199999809,3.839999914,Louisa,23,female,65,235,medium,110,80,,,44,50,10
10014,179,81,35,5.099999905,4.949999809,Buckingham,36,female,63,125,medium,110,76,,,33,36,240
10016,228,115,61,3.700000048,6.389999866,Buckingham,71,female,63,244,large,170,92,,,48,51,660
10020,181,177,24,7.5,7.53000021,Buckingham,64,male,71,225,large,130,66,,,44,47,180
12002,160,100,36,4.400000095,4.619999886,Louisa,43,female,64,140,small,180,110,210,110,37,40,225
12004,188,77,45,4.199999809,4.789999962,Louisa,31,female,67,227,medium,122,70,,,47,53,140
12005,168,101,59,2.799999952,5.090000153,Louisa,44,female,64,160,small,130,88,,,40,43,60
12006,318,270,108,2.900000095,6.510000229,Louisa,60,female,65,167,medium,132,72,,,38,44,30
12501,192,109,44,4.400000095,4.860000134,Buckingham,43,female,64,325,large,141,79,,,53,62,60
12502,209,87,34,6.099999905,4.409999847,Buckingham,48,female,63,121,small,111,62,,,32,38,855
12506,129,110,42,3.099999905,6.130000114,Buckingham,56,male,74,151,small,140,75,,,34,38,90
12507,160,122,41,3.900000095,6.489999771,Buckingham,55,female,67,223,medium,136,83,,,43,48,960
12509,160,196,33,4.800000191,7.510000229,Buckingham,49,male,71,266,large,150,98,,,49,45,90
12751,211,48,34,6.199999809,6.96999979,Louisa,58,male,67,177,medium,162,78,156,82,38,43,315
12754,262,93,43,6.099999905,4.900000095,Louisa,33,female,63,170,medium,110,68,,,33,46,210
12760,201,81,87,2.299999952,4.809999943,Buckingham,48,female,68,146,small,145,95,,,32,41,600
12761,263,82,92,2.900000095,4.579999924,Buckingham,66,female,66,121,small,104,64,,,31,33,30
12763,219,112,73,3,9.180000305,Buckingham,59,male,66,170,medium,146,92,168,98,37,40,120
12765,191,83,88,2.200000048,5.460000038,Buckingham,45,female,67,151,small,130,90,,,33,38,1320
12766,171,97,69,2.5,4.039999962,Buckingham,52,male,71,159,small,125,72,,,33,39,750
12768,219,112,73,3,5.230000019,Buckingham,76,male,64,105,medium,125,82,,,29,33,60
12769,347,197,42,8.300000191,6.340000153,Buckingham,36,male,70,277,large,140,86,,,51,49,900
12772,269,73,34,7.900000095,5.369999886,Buckingham,41,female,62,160,medium,126,90,,,39,41,390
12778,164,71,63,2.599999905,4.510000229,Buckingham,20,male,72,145,small,108,78,,,29,36,1080
13250,181,255,26,7,9.579999924,Buckingham,50,male,71,320,large,140,86,,,56,49,30
13254,190,84,44,4.300000191,5.550000191,Buckingham,43,female,62,163,large,135,88,,,40,45,720
13500,255,112,34,7.5,5.599999905,Louisa,82,male,66,163,,179,89,172,91,37,43,60
13501,218,126,32,6.800000191,4.869999886,Louisa,35,male,69,169,medium,139,90,136,86,39,41,720
13503,223,90,48,4.599999905,5.599999905,Buckingham,47,female,65,232,large,120,86,,,46,54,900
13505,254,342,37,6.900000095,12.97000027,Buckingham,75,male,68,210,large,151,87,,,44,45,15
14756,236,102,36,6.599999905,5.630000114,Buckingham,62,male,76,160,large,150,80,,,35,39,270
14758,176,92,55,3.200000048,4.5,Buckingham,31,female,62,145,small,110,72,,,36,42,720
15007,158,91,31,5.099999905,5.559999943,Louisa,50,male,70,215,large,138,89,137,79,40,45,720
15008,181,83,44,4.099999905,4.03000021,Louisa,39,female,66,255,medium,140,98,,,46,54,210
15010,151,85,48,3.099999905,4.380000114,Louisa,33,male,69,308,large,110,90,,,52,58,300
15012,115,239,36,3.200000048,13.60000038,Louisa,58,male,69,,medium,125,69,,,30,37,10
15013,271,121,40,6.800000191,4.570000172,Louisa,81,female,64,158,medium,146,76,,,36,43,10
15016,190,92,44,4.300000191,4.659999847,Louisa,27,female,65,210,medium,150,106,160,116,39,47,60
15017,118,95,39,3,4.710000038,Louisa,47,female,64,123,small,140,76,,,30,36,300
15250,168,82,44,3.799999952,4.400000095,Buckingham,33,female,66,118,small,98,66,,,29,35,150
15252,254,121,39,6.5,9.25,Buckingham,67,male,68,167,large,161,118,151,111,36,39,60
15260,193,77,45,4.300000191,4.739999771,Buckingham,42,female,75,186,medium,125,90,,,37,46,60
15264,187,84,64,2.900000095,4.400000095,Buckingham,21,female,63,158,small,138,88,,,39,43,180
15271,212,79,49,4.300000191,5.489999771,Buckingham,51,female,65,145,small,230,120,235,120,38,42,60
15274,170,76,60,2.799999952,3.440000057,Buckingham,27,female,63,119,small,122,86,,,28,37,270
15276,215,110,36,6,9.819999695,Louisa,51,female,67,282,medium,142,78,136,84,52,59,420
15277,199,85,59,3.400000095,4.960000038,Louisa,71,male,69,171,large,136,86,,,38,40,240
15278,140,385,31,4.5,11.59000015,Louisa,50,male,69,172,large,138,66,,,37,41,210
15279,216,79,46,4.699999809,4.409999847,Louisa,54,female,65,138,small,132,80,,,33,39,990
15500,204,113,35,5.800000191,4.440000057,Buckingham,59,male,73,187,medium,148,76,148,78,38,37,90
15501,193,248,24,8,7.139999866,Buckingham,59,female,66,189,medium,140,90,,,38,45,90
15502,267,133,34,7.900000095,8.81000042,Louisa,40,female,59,204,small,118,69,,,40,47,780
15512,201,106,53,3.799999952,5.349999905,Louisa,58,male,66,215,large,186,102,190,110,46,44,360
15513,204,120,44,4.599999905,4.690000057,Louisa,72,male,65,167,large,140,72,,,45,46,480
15514,246,104,62,4,7.400000095,Louisa,66,female,66,189,medium,200,94,208,90,45,46,195
15515,229,91,43,5.300000191,4.730000019,Louisa,23,male,72,180,small,110,78,,,34,41,60
15516,172,101,46,3.700000048,4.519999981,Louisa,42,female,65,165,small,118,68,,,33,45,150
15517,197,120,37,5.300000191,4.949999809,Louisa,43,male,71,179,medium,146,98,136,96,37,44,30
15518,205,79,32,6.400000095,4.210000038,Louisa,75,male,69,204,large,136,90,,,44,42,120
15519,219,106,50,4.400000095,4.559999943,Louisa,65,female,63,233,large,140,90,136,86,40,53,45
15520,174,90,36,4.800000191,5.349999905,Louisa,34,male,71,210,medium,142,92,148,98,37,43,90
15521,192,89,30,6.400000095,4.039999962,Louisa,37,male,71,195,medium,136,96,130,98,36,43,630
15522,206,94,44,4.699999809,5.489999771,Louisa,61,female,63,199,medium,180,96,176,94,41,47,720
15527,160,71,44,3.599999905,4.639999866,Louisa,36,female,64,185,medium,110,80,,,39,45,300
15529,216,109,86,2.5,4.400000095,Louisa,45,female,67,147,medium,140,102,148,102,32,38,80
15540,236,111,82,2.900000095,5.239999771,Louisa,68,female,61,119,small,142,96,140,86,29,37,135
15542,205,88,41,5,,Louisa,57,male,66,171,medium,132,82,,,37,40,210
15545,206,112,33,6.199999809,4.03000021,Louisa,41,female,62,184,small,104,80,,,39,44,10
15546,143,371,46,3.099999905,4.809999943,Louisa,68,male,67,158,small,138,82,,,37,43,90
15757,173,83,37,4.699999809,4.309999943,Buckingham,40,female,,130,small,122,76,,,37,38,360
15758,235,91,37,6.400000095,5.230000019,Buckingham,79,female,65,134,small,142,70,,,34,38,240
15760,169,95,29,5.800000191,5.21999979,Buckingham,62,male,66,251,large,118,72,,,50,47,720
15761,283,145,39,7.300000191,8.25,Buckingham,63,female,61,200,medium,190,110,170,90,44,48,720
15762,174,93,77,2.299999952,4.949999809,Buckingham,55,male,70,140,medium,118,86,,,32,33,120
15763,271,103,90,3,4.010000229,Buckingham,55,female,63,114,small,180,105,165,105,30,37,15
15766,203,94,62,3.299999952,4.670000076,Buckingham,27,female,67,209,medium,140,80,,,34,43,780
15773,188,174,24,7.800000191,6.170000076,Louisa,66,male,68,210,large,160,78,158,84,45,48,60
15777,293,87,120,2.400000095,4.760000229,Louisa,63,female,64,179,medium,142,80,142,90,47,45,30
15779,215,80,100,2.200000048,4.659999847,Louisa,78,male,65,109,small,170,88,180,100,33,34,435
15782,207,77,46,4.5,4.820000172,Buckingham,68,male,55,130,small,199,115,190,99,29,33,120
15787,179,77,72,2.5,4.96999979,Buckingham,31,male,66,145,medium,131,79,,,33,38,150
15792,202,81,55,3.700000048,5.5,Buckingham,64,female,62,167,medium,190,118,,,44,47,120
15795,211,98,40,5.300000191,3.549999952,Buckingham,40,female,68,179,small,110,76,,,37,43,60
15797,211,225,29,7.300000191,10.09000015,Buckingham,61,female,63,144,medium,190,100,170,86,40,42,120
15798,151,74,47,3.200000048,4.010000229,Buckingham,28,male,69,130,small,135,75,,,29,35,720
15799,171,85,61,2.799999952,5.099999905,Buckingham,34,female,63,164,medium,120,80,,,34,43,60
15800,342,251,48,7.099999905,12.67000008,Buckingham,63,female,65,201,medium,178,88,160,82,45,46,180
15801,179,236,63,2.799999952,12.06999969,Buckingham,55,male,75,186,medium,122,74,,,38,38,180
15802,155,58,69,2.200000048,4.170000076,Buckingham,26,male,73,174,small,110,76,,,30,35,180
15805,197,92,46,4.300000191,4.75,Buckingham,36,female,64,136,small,,,,,32,37,
15812,200,56,51,3.900000095,3.549999952,Buckingham,40,female,62,105,small,125,64,,,26,33,720
15813,237,96,52,4.599999905,,Buckingham,45,male,69,130,small,137,74,,,33,35,720
15814,198,118,46,4.300000191,4.440000057,Buckingham,68,female,63,124,medium,130,70,,,32,38,60
15815,240,88,49,4.900000095,4.920000076,Buckingham,82,female,63,170,medium,180,86,,,41,46,720
15816,192,56,42,4.599999905,4.590000153,Buckingham,60,female,62,134,small,130,70,,,31,40,90
15818,145,84,54,2.700000048,4.730000019,Buckingham,30,female,65,165,small,102,56,,,33,42,720
15820,269,59,66,4.099999905,5.139999866,Buckingham,41,male,67,191,large,130,73,,,38,41,240
15821,240,96,57,4.199999809,5.739999771,Buckingham,54,female,65,175,medium,152,100,140,100,37,43,60
15827,205,83,42,4.900000095,4.869999886,Buckingham,72,female,61,180,,170,90,150,100,39,47,240
15828,266,82,54,4.900000095,5.409999847,Buckingham,47,male,68,142,medium,118,78,,,35,39,120
16000,188,88,51,3.700000048,5.130000114,Buckingham,50,female,61,147,large,160,66,150,80,34,41,720
16001,222,82,87,2.599999905,4.639999866,Buckingham,51,female,66,110,small,150,110,150,90,28,37,270
16003,142,155,25,5.699999809,6.960000038,Buckingham,45,male,69,204,large,165,115,160,96,40,43,720
16004,268,90,48,5.599999905,5.360000134,Buckingham,38,female,63,181,medium,142,100,144,110,38,46,210
16005,174,105,117,1.5,5.53000021,Buckingham,20,male,70,187,medium,132,86,,,37,41,210
16016,214,87,35,6.099999905,5.380000114,Buckingham,44,female,,190,large,140,75,,,38,44,720
17002,194,54,57,3.400000095,4.260000229,Louisa,63,male,70,181,large,184,76,180,84,37,42,60
17751,196,115,62,3.200000048,4.340000153,Louisa,50,male,67,140,medium,176,110,150,102,35,37,60
17752,207,187,46,4.5,8.569999695,Louisa,44,female,67,201,large,150,74,146,76,46,49,30
17754,204,89,56,3.599999905,5.019999981,Louisa,48,male,68,196,medium,170,96,178,96,38,42,90
17755,189,84,46,4.099999905,4.360000134,Louisa,41,female,63,153,medium,130,80,,,32,40,15
17756,179,77,50,3.599999905,3.329999924,Buckingham,29,male,68,170,small,122,68,,,38,39,300
17757,159,100,54,2.900000095,4.179999828,Buckingham,76,male,66,188,large,116,53,,,40,41,180
17760,260,68,60,4.300000191,4.78000021,Buckingham,69,female,59,179,large,158,98,159,80,45,48,180
17762,228,79,37,6.199999809,4.739999771,Buckingham,26,male,72,259,large,122,90,,,48,49,720
17765,242,74,55,4.400000095,3.970000029,Buckingham,70,female,66,200,medium,140,65,,,41,47,180
17766,227,98,66,3.400000095,6.420000076,Buckingham,25,male,71,162,medium,123,82,,,35,39,900
17767,208,122,51,4.099999905,6.480000019,Buckingham,42,female,62,141,large,118,78,,,33,40,720
17771,208,95,32,6.5,5.599999905,Buckingham,56,male,68,183,medium,131,75,,,36,39,20
17772,209,89,43,4.900000095,4.849999905,Buckingham,31,female,67,160,medium,108,58,,,30,44,240
17773,163,83,57,2.900000095,4.610000134,Buckingham,31,female,65,120,small,136,86,,,29,40,240
17776,201,100,46,4.400000095,4.099999905,Buckingham,27,female,65,145,small,121,75,,,32,35,60
17781,237,118,45,5.300000191,7.510000229,Buckingham,73,female,64,174,large,162,75,,,38,44,300
17784,176,90,34,5.199999809,4.239999771,Buckingham,32,female,63,252,medium,100,72,,,45,58,180
17790,146,79,41,3.599999905,4.760000229,Buckingham,19,female,60,135,medium,108,58,,,33,40,240
17791,231,70,110,2.099999905,3.75,Buckingham,71,female,63,155,small,150,78,,,33,41,900
17794,241,92,40,6,5.039999962,Buckingham,27,female,63,179,medium,120,75,,,40,42,720
17795,305,91,44,6.900000095,5.340000153,Buckingham,31,male,71,211,large,100,60,,,40,45,540
17800,149,77,49,3,4.5,Buckingham,20,female,62,115,small,105,82,,,31,37,720
17802,183,69,51,3.599999905,4.369999886,Buckingham,31,female,66,190,medium,125,70,,,41,47,720
17805,235,109,59,4,7.480000019,Buckingham,62,female,63,290,large,175,80,152,102,55,62,300
17808,244,101,39,6.300000191,4.360000134,Buckingham,44,male,71,168,medium,140,89,,,36,39,720
17813,199,153,77,2.599999905,4.739999771,Buckingham,36,female,66,255,large,118,66,,,47,52,360
17814,224,85,30,7.5,5.260000229,Buckingham,36,male,69,205,medium,150,99,130,80,37,41,360
17816,173,225,31,5.599999905,10.47000027,Buckingham,47,male,73,260,medium,150,98,142,90,42,47,60